{"text_format":"3","workbook":"xlsx","n_sheets":3,"sheets":["INDY","Translation","Selections"],"not_rendered":{"images":1,"defined_names":2,"comments":1},"read":"whole","date_system":"1900"}

{"sheet":"INDY","index":0,"n_rows":87,"n_cols":56,"rows_kept":87,"merged":[[0,43,0,46],[0,48,0,51],[0,53,0,56],[3,0,4,56],[5,0,5,56],[7,28,7,34],[7,35,7,43],[8,1,9,25],[8,30,9,32],[8,38,9,40],[8,46,9,48],[8,49,9,51],[11,1,12,12],[11,13,12,15],[13,53,14,55],[15,14,16,16],[17,1,18,5],[17,21,18,25],[19,1,20,3],[19,15,20,17],[19,21,20,23],[20,28,21,30],[28,51,29,54],[29,46,29,47],[30,51,31,54],[33,51,34,54],[34,46,34,47],[35,51,36,54],[39,16,40,26],[43,50,43,55],[44,15,44,21],[44,50,44,55],[45,15,45,21],[47,15,47,21],[48,52,49,56],[50,53,51,55],[51,20,51,30],[51,33,52,35],[51,40,51,50],[55,20,55,30],[57,40,57,54],[60,20,60,30],[62,48,62,54],[63,48,63,54],[65,20,65,30],[69,40,69,54],[70,24,70,30],[73,18,84,35],[74,13,75,15],[74,48,74,54],[75,48,75,54],[81,40,81,54],[82,13,83,15],[84,48,84,54],[86,0,87,51],[86,52,87,52],[86,53,87,54],[86,55,87,56]]}
[]
[]
[]
[{"$f":"UPPER(Translation!A5)","v":"LES PORTES INDUSTRIELLES"}]
[]
[{"$f":"Translation!A3","v":"Formulaire de commande"}]
[]
[null,{"$f":"Translation!A10","v":"Numéro/dénomination de la commande"},{"$nulls":26},{"$f":"Translation!A11","v":"Quantité"},{"$nulls":6},{"$f":"Translation!A12","v":"Semaine de livraison"}]
[{"$nulls":46},"FR"]
[]
[{"$nulls":28},{"$f":"Translation!A4","v":"Tout est specifié pour une vue de l’intérieur!"}]
[null,{"$f":"Translation!A16","v":"Hauteur du linteau"},{"$nulls":26},{"$f":"Translation!A19","v":"Type de guide"}]
[{"$nulls":16},"mm",{"$nulls":12},"SL350",null,null,{"$f":"Translation!A20","v":"Guide standard (min. 350 mm)"}]
[{"$nulls":29},"SL420",null,null,{"$f":"Translation!A21","v":"Guide standard (min. 420 mm)"},{"$nulls":11},{"$f":"Translation!A144","v":"Renforts"},{"$nulls":8},{"$f":"IF(OR(O16=\"\",P20=\"\",AS15=\"\",O16<6000),\"\",VLOOKUP(P20,Selections!N3:O11,2,TRUE))","v":""}]
[{"$nulls":29},"HL",null,null,{"$f":"Translation!A22","v":"Guide surélevé"},{"$nulls":11},{"$f":"IF(O16>6000,\"X\",\"\")","v":""},null,{"$f":"Translation!A59","v":"Oui"},{"$nulls":5},{"$f":"Translation!A11","v":"Quantité"}]
[{"$nulls":13},{"$f":"Translation!A17","v":"Largeur de l'ouverture (W)"},{"$nulls":15},"HL-T",null,null,{"$f":"Translation!A23","v":"Guide surélevé, T-door"},{"$nulls":11},{"$f":"Translation!A145","v":"Parachute ressort"}]
[{"$nulls":17},"mm",{"$nulls":11},"VL",null,null,{"$f":"Translation!A24","v":"Guide vertical"},{"$nulls":13},{"$f":"Translation!A59","v":"Oui"}]
[null,{"$f":"Translation!A13& CHAR(10)& Translation!A14","v":"Chambranle\nGauche"},{"$nulls":19},{"$f":"Translation!A13& CHAR(10)& Translation!A15","v":"Chambranle\nDroit"},{"$nulls":7},"VL-T",null,null,{"$f":"Translation!A25","v":"Guide vertical, T-Door"},{"$nulls":11},{"$f":"Translation!A194","v":"Arbre préassemblé"}]
[{"$nulls":29},"LL-DT",null,null,{"$f":"Translation!A26","v":"Guide rabaissé (min. 200 mm)"},{"$nulls":13},{"$f":"Translation!A59&Translation!A195","v":"Oui, jusqu'à 4000x4000mm"}]
[{"$nulls":14},{"$f":"Translation!A18","v":"Hauteur de l'ouverture (H)"},{"$nulls":14},"LL-CE",null,null,{"$f":"Translation!A27","v":"Guide rabaissé (min. 230 mm)"},{"$nulls":11},{"$f":"Translation!A140","v":"Ferrures inférieures"}]
[{"$nulls":4},"mm",{"$nulls":13},"mm",{"$nulls":5},"mm",{"$nulls":6},{"$f":"IF(AG22<>\"\",\"°\",\"\")","v":"°"},{"$nulls":14},{"$f":"Translation!A141","v":"En aluminium"}]
[{"$nulls":32},{"$f":"IF(OR(AC13<>\"\",AC14<>\"\",AC15<>\"\",AC19<>\"\",AC20<>\"\",AND(AC13=\"\",AC14=\"\",AC15=\"\",AC16=\"\",AC17=\"\",AC18=\"\",AC19=\"\",AC20=\"\")),Translation!A28,\"\")","v":"Guide oblique"},{"$nulls":13},{"$f":"Translation!A143","v":"Parachutes câble"}]
[null,{"$f":"Translation!A280","v":"En cas des alignements des panneaux avec des portes attenants, notez cette information sur la commande avec lesquelles portes désirez-vous les alignements des panneaux."}]
[]
[null,"STANDARD",{"$nulls":8},"PROTECT",{"$nulls":18},{"$f":"Translation!A43","v":"Porte d’entrée"}]
[null,{"$f":"Translation!A32","v":"Lamelle stucco"},{"$nulls":8},{"$f":"Translation!A32","v":"Lamelle stucco"},{"$nulls":8},{"$f":"Translation!A37","v":"Profilé en V lisse"}]
[{"$nulls":3},"533; 9010/9002",{"$nulls":8},"672; 9010/9010",{"$nulls":8},"687; 9006/9010",{"$nulls":7},{"$f":"Translation!A44","v":"Hauteur du seuil"},{"$nulls":11},{"$f":"Translation!A53","v":"Sens d’ouverture"}]
[{"$nulls":3},"531; 9002/9002",{"$nulls":8},"671; 9002/9010",{"$nulls":8},"682; 7016/9010",{"$nulls":9},{"$f":"Translation!A45","v":"Seuil standard (220 mm)"},{"$nulls":11},{"$f":"Translation!A54&\"; \"&Translation!A55","v":"charnières du côté gauche; DIN droit"}]
[{"$nulls":3},"532; 9006/9002",{"$nulls":8},"673; 9006/9010",{"$nulls":6},{"$f":"Translation!A38","v":"Sans rainure stucco"},{"$nulls":11},{"$f":"Translation!A46","v":"Seuil extra-bas (25 mm)"},{"$nulls":19},{"$f":"Translation!A65","v":"Extér."}]
[{"$nulls":3},"536; 9007/9002",{"$nulls":8},"694; 9007/9010",{"$nulls":8},"699; 9010/9010"]
[{"$nulls":3},"534; 7016/9002",{"$nulls":8},"754; 1021/9010",{"$nulls":16},{"$f":"Translation!A48","v":"Emplacement de la porte"},{"$nulls":21},{"$f":"Translation!A66","v":"Intér."}]
[{"$nulls":3},"535; 5010/9002",{"$nulls":8},"675; 3000/9010",{"$nulls":6},{"$f":"Translation!A39","v":"Sans rainure lisse"},{"$nulls":11},{"$f":"Translation!A49","v":"À gauche"}]
[{"$nulls":3},"538; 8014/9002",{"$nulls":8},"676; 5010/9010",{"$nulls":8},"667; 9016/9010",{"$nulls":9},{"$f":"Translation!A50","v":"Au centre"},{"$nulls":11},{"$f":"Translation!A56&\"; \"&Translation!A57","v":"charnières du côté droit; DIN à gauche"}]
[{"$nulls":3},"540; 7021/9002",{"$nulls":8},"677; 6009/9010",{"$nulls":8},"668; 7016/9010",{"$nulls":9},{"$f":"Translation!A51","v":"À droite"},{"$nulls":19},{"$f":"Translation!A65","v":"Extér."}]
[{"$nulls":12},"679; 8014/9010",{"$nulls":8},"680; DB703/9010"]
[null,{"$f":"Translation!A37","v":"Profilé en V lisse"},{"$nulls":10},"678; 7016/9010",{"$nulls":16},{"$f":"Translation!A47","v":"Contact de la porte"},{"$nulls":21},{"$f":"Translation!A66","v":"Intér."}]
[{"$nulls":3},"539; 9006/9002",{"$nulls":8},"684; 9005/9010",{"$nulls":6},{"$f":"Translation!A40","v":"Sans rainure woodgrain"},{"$nulls":11},{"$f":"Translation!A49","v":"À gauche"}]
[{"$nulls":21},"669; 9010/9010",{"$nulls":9},{"$f":"Translation!A51","v":"À droite"}]
[null,{"$f":"Translation!A32&\", 80 mm\"","v":"Lamelle stucco, 80 mm"}]
[{"$nulls":3},"531-80; 9002/9002",{"$nulls":8},{"$f":"Translation!A42","v":"Autre :"},{"$nulls":16},{"$f":"Translation!A67","v":"Type de poignée et de serrure"},{"$nulls":10},{"$f":"Translation!A58","v":"Peinture des profilés de la porte"}]
{"$rows_left_out":48}
{"sheet":"Translation","index":1,"n_rows":306,"n_cols":59,"rows_kept":306,"hidden":true}
[{"$f":"IF(INDY!AU9=I1,1,IF(INDY!AU9=J1,2,IF(INDY!AU9=K1,3,IF(INDY!AU9=L1,4,IF(INDY!AU9=M1,5,IF(INDY!AU9=N1,6,\"Chyba\"))))))","v":6},{"$nulls":7},"CZ","EN","DE","PL","NL","FR"]
[{"$f":"VLOOKUP(I2,I:N,$A$1,FALSE)","v":"République tchèque"},{"$nulls":7},"Česká republika","Czech Republic","Tschechische Republik","Republika Czeska","Tsjechische Republiek","République tchèque"]
["Formulaire de commande",{"$nulls":7},"Objednávkový formulář","Order Form","Bestellformular","Formularz zamówienia","Bestelformulier","Formulaire de commande"]
["Tout est specifié pour une vue de l’intérieur!",{"$nulls":7},"Vše specifikováno při pohledu zevnitř!","All views are interior views!","Alles ist bestimmt bei INNENANSICHT","Wszystko jest specyfikowane z widokiem od zewnątrz!","Alles gespecificeerd van binnenuit gezien!","Tout est specifié pour une vue de l’intérieur!"]
["Les Portes Industrielles",{"$nulls":7},"Průmyslová vrata","Industrial door","Industrietor","Brama przemysłowa","Industriële deur","Les Portes Industrielles"]
["Porte de garage",{"$nulls":7},"Garážová vrata","Garage door","Garagentor","Brama garażowa","Garagedeur","Porte de garage"]
["Portail à deux battants",{"$nulls":7},"Dvoukřídlá vrata","Double leaf door","Zweiflüglig Tor","Brama dwuskrzydłowa","Tweevleugelige deur","Portail à deux battants"]
["Porte d’entrée latérale (ManDoor)",{"$nulls":7},"Boční vstupní dveře (ManDoor)","Side entrance door (ManDoor)","Nebeneingangstür (ManDoor)","Boczne drzwi wejściowe (ManDoor)","Deur voor zij-ingang","Porte d’entrée latérale (ManDoor)"]
["Porte d’entrée latérale (ManDoor NG)",{"$nulls":7},"Boční vstupní dveře (ManDoor NG)","Side entrance door (ManDoor NG)","Nebeneingangstür (ManDoor NG)","Boczne drzwi wejściowe (ManDoor NG)","Deur voor zij-ingang NG","Porte d’entrée latérale (ManDoor NG)"]
["Numéro/dénomination de la commande",{"$nulls":7},"Číslo/název objednávky","Order No. or name","Auftragsnummer","Nr/nazwa zamówienia","Ordernummer/ordernaam","Numéro/dénomination de la commande"]
["Quantité",{"$nulls":7},"Počet kusů","Quantity","Stückzahl","Ilość sztuk","Aantal stuks","Quantité"]
["Semaine de livraison",{"$nulls":7},"Dodací týden","Delivery week","Lieferwoche","Tydzień dostawy","Leveringsweek","Semaine de livraison"]
["Chambranle",{"$nulls":7},"Ostění","Side room","Leibung","Węgarek","Bekleding","Chambranle"]
["Gauche",{"$nulls":7},"Levé","Left","Links","Lewy","Links","Gauche"]
["Droit",{"$nulls":7},"Pravé","Right","Rechts","Prawy","Rechts","Droit"]
["Hauteur du linteau",{"$nulls":7},"Výška překladu","Height of lintel","Sturzhöhe","Wysokość nadproża","Hoogte van de bovenste draagconstr.","Hauteur du linteau"]
["Largeur de l'ouverture (W)",{"$nulls":7},"Šířka otvoru (W)","Width of opening (W)","Lichte Breite","Szerokość otworu (W)","Breedte van de open. (B)","Largeur de l'ouverture (W)"]
["Hauteur de l'ouverture (H)",{"$nulls":7},"Výška otvoru (H)","Height of opening (H)","Lichte Höhe","Wysokość otworu (H)","Hoogte van de opening (H)","Hauteur de l'ouverture (H)"]
["Type de guide",{"$nulls":7},"Typ vedení","Lift type","Umlenkung (Beschlagstyp)","Rodzaj prowadzenia","Type geleiding","Type de guide"]
["Guide standard (min. 350 mm)",{"$nulls":7},"Standardní vedení (min. 350 mm)","Standard lift (min. 350 mm)","Standardbeschlag SL 350","Prowad. standard. (min 350 mm)","Standaardgeleiding (min. 350 mm)","Guide standard (min. 350 mm)"]
["Guide standard (min. 420 mm)",{"$nulls":7},"Standardní vedení (min. 420 mm)","Standard lift (min. 420 mm)","Standardbeschlag SL 420","Prowad. standard. (min 420 mm)","Standaardgeleiding (min. 420 mm)","Guide standard (min. 420 mm)"]
["Guide surélevé",{"$nulls":7},"Zvýšené vedení","High lift","Hochführung","Prowad. podwyższone","Verhoogde geleiding","Guide surélevé"]
["Guide surélevé, T-door",{"$nulls":7},"Zvýšené vedení, T-door","High lift, T-Door","Hochführung - Federwelle unten","Prowad. podwyższone, T-door","Verhoogde geleiding, T-deur","Guide surélevé, T-door"]
["Guide vertical",{"$nulls":7},"Vertikální vedení","Vertical lift","Vertikalbesch. - Senkrechtläufer","Prowad. pionowe","Verticale geleiding","Guide vertical"]
["Guide vertical, T-Door",{"$nulls":7},"Vertikální vedení, T-Door","Vertical lift, T-Door","Vertikalbeschl. - Federwelle unt.","Prowad. pionowe, T-door","Verticale geleiding, T-deur","Guide vertical, T-Door"]
["Guide rabaissé (min. 200 mm)",{"$nulls":7},"Snížené vedení (min. 200 mm)","Low lift (min. 200 mm)","Niedrigsturz (min. 200 mm)","Prowad. obniżone (min 200 mm)","Verlaagde geleiding (min. 200 mm)","Guide rabaissé (min. 200 mm)"]
["Guide rabaissé (min. 230 mm)",{"$nulls":7},"Snížené vedení (min. 230 mm)","Low lift (min. 230 mm)","Niedrigsturz (min. 230 mm)","Prowad. obniżone (min 230 mm)","Verlaagde geleiding (min. 230 mm)","Guide rabaissé (min. 230 mm)"]
["Guide oblique",{"$nulls":7},"Vedení pod úhlem","Following the roof","Dachfolgebeschlag","Prowadzenie pod kątem","Geleiding onder een hoek","Guide oblique"]
["Système de rénovation",{"$nulls":7},"Renovační systém","Renovation system","Renovierungssystem","System renowacyjny","Renovatiesysteem","Système de rénovation"]
["Guide rabaissé (min. 200 mm)",{"$nulls":7},"Snížené vedení (min. 200 mm)","Low lift (min. 200 mm)","Niedrigsturz (min. 200 mm)","LHF-C Low Lift","LHF-C Low Lift","LHF-C Low Lift"]
["Guide rabaissé (min. 90 mm)",{"$nulls":7},"Snížené vedení (min. 90 mm)","Low lift (min. 90 mm)","Niedrigsturz (min. 90 mm)","Prowad. obniżone (min 90 mm)","Verlaagde geleiding (min. 90 mm)","Guide rabaissé (min. 90 mm)"]
["Lamelle stucco",{"$nulls":7},"Lamela stucco","Lamella stucco","Lamelle stucco","Płytka stucco","Lamel stucwerk","Lamelle stucco"]
["Lamelle lisse",{"$nulls":7},"Lamela hladká","Lamella smooth","Lamelle glatt","Płytka gładka","Lamel glad","Lamelle lisse"]
["Lamelle woodgrain",{"$nulls":7},"Lamela woodgrain","Lamella woodgrain","Lamelle Woodgrain","Płytka woodgrain","Lamel houtnerf","Lamelle woodgrain"]
["Rainure centrale woodgrain",{"$nulls":7},"Stř. drážka woodgrain","Central rib woodgrain","Mittelsicke Woodgrain","Przetłocz. centralne woodgr.","Centrale groef houtnerf","Rainure centrale woodgrain"]
["Rainure centrale lisse",{"$nulls":7},"Stř. drážka hladká","Central rib smooth","Mittelsicke Glatt","Przetłocz. centralne gładka","Centrale groef glad","Rainure centrale lisse"]
["Profilé en V lisse",{"$nulls":7},"V-profil hladká","V-profile smooth","V-Profil glatt ","V-profil gładka","V-profiel glad","Profilé en V lisse"]
["Sans rainure stucco",{"$nulls":7},"Bez drážky stucco","Flat stucco","Ohne Sicke stucco","Bez przetłoczenia stucco","Zonder groef stucwerk","Sans rainure stucco"]
["Sans rainure lisse",{"$nulls":7},"Bez drážky hladká","Flat smooth","Ohne Sicke glatt","Bez przetłoczenia gładka","Zonder groef glad","Sans rainure lisse"]
["Sans rainure woodgrain",{"$nulls":7},"Bez drážky woodgrain","Flat woodgrain","Ohne Sicke woodgrain","Bez przetłoczenia woodgrain","Zonder groef houtnerf","Sans rainure woodgrain"]
{"$rows_left_out":267}
{"sheet":"Selections","index":2,"n_rows":85,"n_cols":56,"rows_kept":85,"hidden":true}
["Výběr jazyka",null,"Výběry pro INDY"]
["CZ",null,{"$f":"Translation!A95","v":"Barrières, barrière verrouillables"},{"$f":"Translation!A106","v":"Poignées"},"Okna INDY",{"$f":"Translation!A92","v":"Section Full Vision"},{"$f":"Translation!A93","v":"Section isolée"},{"$f":"Translation!A94","v":"Séction avec métal déployé"},{"$f":"Translation!A163","v":"Grilles de ventilation"},{"$f":"Translation!A196","v":"Cornière de soutien"},{"$nulls":3},{"$f":"Translation!A144&\" \"&Translation!A11","v":"Renforts Quantité"}]
["EN",{"$nulls":12},0,3]
["DE",null,{"$f":"Translation!A96","v":"490 ; Barrière"},{"$f":"Translation!A108","v":"460 ; Poignée bilatérale"},{"$f":"Translation!A76","v":"203 ; Ovale 1, CLICK"},{"$f":"Translation!A118","v":"250 ; Double vitrage SAN UV"},{"$f":"Translation!A125","v":"270 ; Panneaux en aluminium isolé stucco"},{"$f":"Translation!A127","v":"280 ; Tôle de choc, œillet 16/8"},{"$f":"Translation!A164","v":"Noir/blanc"},{"$f":"Translation!A197","v":"30x30, Équerre percée, orifices ronds"},{"$nulls":3},1871,4]
["PL",null,{"$f":"Translation!A97","v":"491 ; Barrière"},{"$f":"Translation!A109","v":"463 ; poignée bilatérale"},{"$f":"Translation!A77","v":"205 ; Carré 1, CLICK"},{"$f":"Translation!A119","v":"220 ; Simple vitrage SAN UV"},{"$f":"Translation!A126","v":"270.20 ; Panneaux en aluminium isolé hladké"},{"$f":"Translation!A128","v":"280 ; Tôle de choc, œillet 22/12"},{"$f":"Translation!A165","v":"Blanc/blanc"},{"$f":"Translation!A198","v":"30x30, Équerre percée, orifices ovales"},{"$nulls":3},2501,5]
["NL",null,{"$f":"Translation!A98","v":"492B ; Barrière verrouillable"},{"$f":"Translation!A107","v":"466 ; Poignée unilatérale"},{"$f":"Translation!A80","v":"217 ; Rond"},{"$f":"Translation!A120","v":"260 ; Double vitrage en polycarbonate"},{"$nulls":3},{"$f":"Translation!A199","v":"50x50, Équerre percée, orifices ronds"},{"$nulls":3},3101,6]
["FR",null,{"$f":"Translation!A99","v":"493B Barrière verrouillable"},null,{"$f":"Translation!A79","v":"216 ; Carré 9"},{"$f":"Translation!A121","v":"230 ; Simple vitrage en polycarbonate"},{"$nulls":3},{"$f":"Translation!A200","v":"50x50, Équerre percée, orifices ovales"},{"$nulls":3},3701,7]
[null,null,{"$f":"Translation!A100","v":"495 ; Barrière verrouillable"},null,{"$f":"Translation!A78","v":"207 ; Carré 2"},{"$f":"Translation!A122","v":"250.10 ; Double vitrage SAN UV, 1x ANTI SCRATCH"},{"$nulls":7},4311,8]
["Ano",null,{"$f":"Translation!A101","v":"497A ; Barrière verrouillable"},null,{"$f":"Translation!A81","v":"218 ; Carré INOX"},{"$f":"Translation!A123","v":"250.20 ; Double vitrage SAN UV, 2x ANTI SCRATCH"},{"$nulls":7},4921,9]
["Ne",null,{"$f":"Translation!A102","v":"497B ; Barrière verrouillable"},null,{"$f":"Translation!A82","v":"215 ; Rond INOX"},{"$f":"Translation!A124","v":"250.Co ; Double vitrage SAN UV ; coloré"},{"$nulls":7},5531,10]
[null,null,{"$f":"Translation!A103","v":"498 ; Barrière verrouillable"},null,{"$f":"Translation!A83","v":"211 ; Ovale 1, panneau de 80 mm"},{"$nulls":8},6141,11]
[{"$nulls":4},{"$f":"Translation!A84","v":"212 ; Carré 1, panneau de 80 mm"}]
[{"$nulls":4},{"$f":"Translation!A85","v":"216 ; Carré 9, panneau de 80 mm"}]
[]
[null,null,"Výběry pro GUARDY"]
[null,null,{"$f":"Translation!B95","v":0},{"$f":"Translation!B106","v":0},{"$f":"Translation!B75","v":0},{"$f":"Translation!B92","v":0},{"$f":"Translation!B93","v":0},{"$f":"Translation!B94","v":0},{"$f":"Translation!B163","v":0},{"$f":"Translation!B196","v":0}]
[]
[null,null,{"$f":"Translation!B96","v":0},{"$f":"Translation!B107","v":0},{"$f":"Translation!B86","v":0},{"$f":"Translation!B118","v":0},{"$f":"Translation!B125","v":0},{"$f":"Translation!B127","v":0},{"$f":"Translation!B164","v":0},{"$f":"Translation!B197","v":0}]
[null,null,{"$f":"Translation!B97","v":0},{"$f":"Translation!B110","v":0},{"$f":"Translation!B87","v":0},{"$f":"Translation!B119","v":0},{"$f":"Translation!B126","v":0},{"$f":"Translation!B128","v":0},{"$f":"Translation!B165","v":0},{"$f":"Translation!B198","v":0}]
[null,null,{"$f":"Translation!B98","v":0},{"$f":"Translation!B111","v":0},{"$f":"Translation!B88","v":0},{"$f":"Translation!B120","v":0},{"$nulls":3},{"$f":"Translation!B201","v":0}]
[null,null,{"$f":"Translation!B100","v":0},{"$f":"Translation!B108","v":0},{"$f":"Translation!B89","v":0},{"$f":"Translation!B121","v":0}]
[null,null,{"$f":"Translation!B103","v":0},{"$f":"Translation!B109","v":0},{"$f":"Translation!B79","v":0},{"$f":"Translation!B122","v":0}]
[null,null,{"$f":"Translation!B101","v":0},{"$f":"Translation!B112","v":0},{"$f":"Translation!B90","v":0},{"$f":"Translation!B123","v":0}]
[null,null,{"$f":"Translation!B102","v":0},{"$f":"Translation!B113","v":0},{"$f":"Translation!B81","v":0},{"$f":"Translation!B124","v":0}]
[null,null,{"$f":"Translation!B104","v":0},null,{"$f":"Translation!B91","v":0}]
[null,null,{"$f":"Translation!B105","v":0},null,{"$f":"Translation!B82","v":0}]
[{"$nulls":4},{"$f":"Translation!B78","v":0}]
[{"$nulls":4},{"$f":"Translation!B80","v":0}]
[{"$nulls":4},{"$f":"Translation!B76","v":0}]
[{"$nulls":4},{"$f":"Translation!B77","v":0}]
[]
[null,null,"Výběry pro EXT"]
[null,null,{"$f":"Translation!C95","v":0},{"$f":"Translation!C106","v":0},{"$f":"Translation!C75","v":0},{"$f":"Translation!C92","v":0},{"$f":"Translation!C93","v":0},{"$f":"Translation!C94","v":0},{"$f":"Translation!C163","v":0},{"$f":"Translation!C196","v":0}]
[]
[null,null,{"$f":"Translation!C96","v":0},{"$f":"Translation!C107","v":0},{"$f":"Translation!C86","v":0},{"$f":"Translation!C118","v":0},{"$f":"Translation!C125","v":0},{"$f":"Translation!C127","v":0},{"$f":"Translation!C164","v":0},{"$f":"Translation!C197","v":0}]
[null,null,{"$f":"Translation!C97","v":0},{"$f":"Translation!C110","v":0},{"$f":"Translation!C87","v":0},{"$f":"Translation!C119","v":0},{"$f":"Translation!C126","v":0},{"$f":"Translation!C128","v":0},{"$f":"Translation!C165","v":0},{"$f":"Translation!C198","v":0}]
[null,null,{"$f":"Translation!C100","v":0},{"$f":"Translation!C111","v":0},{"$f":"Translation!C88","v":0},{"$f":"Translation!C120","v":0},{"$nulls":3},{"$f":"Translation!C201","v":0}]
[null,null,{"$f":"Translation!C101","v":0},{"$f":"Translation!C108","v":0},{"$f":"Translation!C89","v":0},{"$f":"Translation!C121","v":0}]
[null,null,{"$f":"Translation!C102","v":0},{"$f":"Translation!C109","v":0},{"$f":"Translation!C79","v":0},{"$f":"Translation!C122","v":0}]
[null,null,{"$f":"Translation!C104","v":0},{"$f":"Translation!C112","v":0},{"$f":"Translation!C90","v":0},{"$f":"Translation!C123","v":0}]
{"$rows_left_out":45}